codecamp

assertContains()

assertContains()

assertContains(mixed $needle, Iterator|array $haystack[, string $message = ''])

$needle 不是 $haystack的元素时报告错误,错误讯息由 $message 指定。

assertNotContains() 是与之相反的断言,接受相同的参数。

assertAttributeContains()assertAttributeNotContains() 是便捷包装(convenience wrapper),以某个类或对象的 publicprotectedprivate 属性为搜索范围。

Example A.5. assertContains() 的用法

<?php
class ContainsTest extends PHPUnit_Framework_TestCase
{
    public function testFailure()
    {
        $this->assertContains(4, array(1, 2, 3));
    }
}
?>
phpunit ContainsTest

PHPUnit 5.0.0 by Sebastian Bergmann and contributors.

F

Time: 0 seconds, Memory: 5.00Mb

There was 1 failure:

1) ContainsTest::testFailure
Failed asserting that an array contains 4.

/home/sb/ContainsTest.php:6

FAILURES!
Tests: 1, Assertions: 1, Failures: 1.

assertContains(string $needle, string $haystack[, string $message = '', boolean $ignoreCase = FALSE])

$needle 不是 $haystack 的子字符串时报告错误,错误讯息由 $message 指定。

如果 $ignoreCaseTRUE,测试将按大小写不敏感的方式进行。

Example A.6. assertContains() 的用法

<?php
class ContainsTest extends PHPUnit_Framework_TestCase
{
    public function testFailure()
    {
        $this->assertContains('baz', 'foobar');
    }
}
?>
phpunit ContainsTest

PHPUnit 5.0.0 by Sebastian Bergmann and contributors.

F

Time: 0 seconds, Memory: 5.00Mb

There was 1 failure:

1) ContainsTest::testFailure
Failed asserting that 'foobar' contains "baz".

/home/sb/ContainsTest.php:6

FAILURES!
Tests: 1, Assertions: 1, Failures: 1.

Example A.7. 带有 $ignoreCase 参数的 assertContains() 的用法

<?php
class ContainsTest extends PHPUnit_Framework_TestCase
{
    public function testFailure()
    {
        $this->assertContains('foo', 'FooBar');
    }

    public function testOK()
    {
        $this->assertContains('foo', 'FooBar', '', true);
    }
}
?>
phpunit ContainsTest

PHPUnit 5.0.0 by Sebastian Bergmann and contributors.

F.

Time: 0 seconds, Memory: 2.75Mb

There was 1 failure:

1) ContainsTest::testFailure
Failed asserting that 'FooBar' contains "foo".

/home/sb/ContainsTest.php:6

FAILURES!
Tests: 2, Assertions: 2, Failures: 1.
assertClassHasStaticAttribute()
assertContainsOnly()
温馨提示
下载编程狮App,免费阅读超1000+编程语言教程
取消
确定
目录

3. 命令行测试执行器

7. 未完成的测试与跳过的测试

12. 测试的其他用途

关闭

MIP.setData({ 'pageTheme' : getCookie('pageTheme') || {'day':true, 'night':false}, 'pageFontSize' : getCookie('pageFontSize') || 20 }); MIP.watch('pageTheme', function(newValue){ setCookie('pageTheme', JSON.stringify(newValue)) }); MIP.watch('pageFontSize', function(newValue){ setCookie('pageFontSize', newValue) }); function setCookie(name, value){ var days = 1; var exp = new Date(); exp.setTime(exp.getTime() + days*24*60*60*1000); document.cookie = name + '=' + value + ';expires=' + exp.toUTCString(); } function getCookie(name){ var reg = new RegExp('(^| )' + name + '=([^;]*)(;|$)'); return document.cookie.match(reg) ? JSON.parse(document.cookie.match(reg)[2]) : null; }